Search Mailing List Archives


Limit search to: Subject & Body Subject Author
Sort by: Reverse Sort
Limit to: All This Week Last Week This Month Last Month
Select Date Range     through    

[protege-dev] BUILD FAILURE...could not resolve depedencies

OntoBLW bayoudhileila at yahoo.fr
Mon Feb 6 09:08:25 PST 2017


Hi,
I am developing a plugin. All was working fine until a build failure was
raised. Is it related to a network problem? how can I fix it? In what
follows the message appended in my IDE:
------------------------------------------------------------------------
Building OWLChanges 1.0.1-SNAPSHOT
------------------------------------------------------------------------
The metadata
C:\Users\g50\.m2\repository\org\eclipse\equinox\common\maven-metadata-central.xml
is invalid: attribute value must start with quotation or apostrophe not C
(position: TEXT seen <html><head>\n<meta http-equiv=C... @2:19) 
------------------------------------------------------------------------
BUILD FAILURE
------------------------------------------------------------------------
Total time: 1.798s
Finished at: Mon Feb 06 17:37:22 GMT+01:00 2017
Final Memory: 6M/15M
------------------------------------------------------------------------
Failed to execute goal on project protege.plugin.owlchanges: Could not
resolve dependencies for project
edu.stanford.protege:protege.plugin.owlchanges:bundle:1.0.1-SNAPSHOT:
Failure to find org.eclipse.equinox:common:jar:3.3.0-v20070426 in
https://repository.sonatype.org/content/groups/forge/ was cached in the
local repository, resolution will not be reattempted until the update
interval of sonatype-forge has elapsed or updates are forced -> [Help 1]

To see the full stack trace of the errors, re-run Maven with the -e switch.
Re-run Maven using the -X switch to enable full debug logging.

For more information about the errors and possible solutions, please read
the following articles:
[Help 1]
http://cwiki.apache.org/confluence/display/MAVEN/DependencyResolutionException



--
View this message in context: http://protege-project.136.n4.nabble.com/BUILD-FAILURE-could-not-resolve-depedencies-tp4667439.html
Sent from the Protege Developer mailing list archive at Nabble.com.


More information about the protege-dev mailing list